Target
Xanthine dehydrogenase/oxidase
Ligand
BDBM60928
Substrate
Meas. Tech.
Determination of Xanthine Oxidase Inhibitory Activity of Aryl Benzofuran Amidated Derivatives and Reagents (Amino Derivatives)
IC50
>60000±n/a nM
Citation
 Chen, J Type of aryl benzofuran amidated derivative and medical use thereof US Patent  US11021454 Publication Date 6/1/2021 
Target
Name:
Xanthine dehydrogenase/oxidase
Synonyms:
XD XDHA XO Xanthine dehydrogenase/oxidase | Xanthine oxidase
Type:
Enzyme
Mol. Mass.:
146441.21
Organism:
Homo sapiens (Human)
Description:
P47989
Residue:
1333
  
Inhibitor
Name:
BDBM60928
Synonyms:
BDBM50130192 L-DOPA dihydroxyphenylalanine
Type:
Emp. Form.:
C9H11NO4
Mol. Mass.:
197.1879
SMILES:
N[C@@H](Cc1ccc(O)c(O)c1)C(O)=O
: