Target
Xanthine dehydrogenase/oxidase
Ligand
BDBM21974
Substrate
Meas. Tech.
Determination of Xanthine Oxidase Inhibitory Activity of Aryl Benzofuran Amidated Derivatives and Reagents (Amino Derivatives)
IC50
>60000±n/a nM
Citation
 Chen, J Type of aryl benzofuran amidated derivative and medical use thereof US Patent  US11021454 Publication Date 6/1/2021 
Target
Name:
Xanthine dehydrogenase/oxidase
Synonyms:
XD XDHA XO Xanthine dehydrogenase/oxidase | Xanthine oxidase
Type:
Enzyme
Mol. Mass.:
146441.21
Organism:
Homo sapiens (Human)
Description:
P47989
Residue:
1333
  
Inhibitor
Name:
BDBM21974
Synonyms:
(2S)-2-amino-3-(1H-indol-3-yl)propanoic acid L-tryptophan US9138393, L-Tryptophan | US9144538, L-Tryptophan
Type:
Amino Acid
Emp. Form.:
C11H12N2O2
Mol. Mass.:
204.2252
SMILES:
N[C@@H](Cc1c[nH]c2ccccc12)C(O)=O
: