Target
Xanthine dehydrogenase/oxidase
Ligand
BDBM18129
Substrate
Meas. Tech.
Determination of Xanthine Oxidase Inhibitory Activity of Aryl Benzofuran Amidated Derivatives and Reagents (Amino Derivatives)
IC50
>60000±n/a nM
Citation
 Chen, J Type of aryl benzofuran amidated derivative and medical use thereof US Patent  US11021454 Publication Date 6/1/2021 
Target
Name:
Xanthine dehydrogenase/oxidase
Synonyms:
XD XDHA XO Xanthine dehydrogenase/oxidase | Xanthine oxidase
Type:
Enzyme
Mol. Mass.:
146441.21
Organism:
Homo sapiens (Human)
Description:
P47989
Residue:
1333
  
Inhibitor
Name:
BDBM18129
Synonyms:
(2S)-2-amino-3-(4-hydroxyphenyl)propanoic acid Tyrosine | US11021454, Compound L-tyr
Type:
Amino Acid
Emp. Form.:
C9H11NO3
Mol. Mass.:
181.1885
SMILES:
N[C@@H](Cc1ccc(O)cc1)C(O)=O
: