Target
Xanthine dehydrogenase/oxidase
Ligand
BDBM50142500
Substrate
Meas. Tech.
Determination of Xanthine Oxidase Inhibitory Activity of Aryl Benzofuran Amidated Derivatives and Reagents (Amino Derivatives)
IC50
>60000±n/a nM
Citation
 Chen, J Type of aryl benzofuran amidated derivative and medical use thereof US Patent  US11021454 Publication Date 6/1/2021 
Target
Name:
Xanthine dehydrogenase/oxidase
Synonyms:
XD XDHA XO Xanthine dehydrogenase/oxidase | Xanthine oxidase
Type:
Enzyme
Mol. Mass.:
146441.21
Organism:
Homo sapiens (Human)
Description:
P47989
Residue:
1333
  
Inhibitor
Name:
BDBM50142500
Synonyms:
(2S)-2-amino-4-(methylsulfanyl)butanoic acid (S)-2-amino-4-(methylthio)butyric acid CHEMBL42336 L-Methionin L-methionine | US11021454, Compound L-met
Type:
Small organic molecule
Emp. Form.:
C5H11NO2S
Mol. Mass.:
149.211
SMILES:
CSCC[C@H](N)C(O)=O
: