Target
Xanthine dehydrogenase/oxidase
Ligand
BDBM50233801
Substrate
Meas. Tech.
The antioxidant activity of the synthesized benzofuran amidated derivative is evaluated by DPPH free radical scavenging experiment.
IC50
47250±n/a nM
Citation
 Chen, J Type of aryl benzofuran amidated derivative and medical use thereof US Patent  US11021454 Publication Date 6/1/2021 
Target
Name:
Xanthine dehydrogenase/oxidase
Synonyms:
XD XDHA XO Xanthine dehydrogenase/oxidase | Xanthine oxidase
Type:
Enzyme
Mol. Mass.:
146441.21
Organism:
Homo sapiens (Human)
Description:
P47989
Residue:
1333
  
Inhibitor
Name:
BDBM50233801
Synonyms:
CHEMBL4101163 | US11021454, Compound 5e
Type:
Small organic molecule
Emp. Form.:
C27H23NO8
Mol. Mass.:
489.4734
SMILES:
COC(=O)[C@H](Cc1ccc(O)cc1)NC(=O)\C=C\c1ccc(O)c2oc(cc12)-c1ccc(O)c(O)c1
: