Target
Microtubule-associated proteins 1A/1B light chain 3B
Ligand
BDBM499996
Substrate
Meas. Tech.
Assay Targeting LC3B
IC50
<3±n/a nM
Citation
 Yao, ZLuo, CXie, YYue, LWan, WZhang, YJiang, HChen, K Class of isoindolone-imide ring-1,3-dione-2-ene compounds, composition and use thereof US Patent  US11021457 Publication Date 6/1/2021 
Target
Name:
Microtubule-associated proteins 1A/1B light chain 3B
Synonyms:
Autophagy-related protein LC3 B MAP1 light chain 3-like protein 2 MAP1A/MAP1B light chain 3 B MAP1LC3B Microtubule-associated protein 1 light chain 3 beta
Type:
Protein
Mol. Mass.:
14691.38
Organism:
Human
Description:
Q9GZQ8
Residue:
125
  
Inhibitor
Name:
BDBM499996
Synonyms:
US11021457, Compound 5
Type:
Small organic molecule
Emp. Form.:
C28H22N4O6
Mol. Mass.:
510.4975
SMILES:
O=C1N(C2CCC(=O)NC2=O)C(=O)c2c1cccc2NC=C1C(=O)CC(CC1=O)c1cccc2[nH]ccc12
: