Target
Microtubule-associated proteins 1A/1B light chain 3B
Ligand
BDBM500132
Substrate
Meas. Tech.
Assay Targeting LC3B
IC50
<3±n/a nM
Citation
 Yao, ZLuo, CXie, YYue, LWan, WZhang, YJiang, HChen, K Class of isoindolone-imide ring-1,3-dione-2-ene compounds, composition and use thereof US Patent  US11021457 Publication Date 6/1/2021 
Target
Name:
Microtubule-associated proteins 1A/1B light chain 3B
Synonyms:
Autophagy-related protein LC3 B MAP1 light chain 3-like protein 2 MAP1A/MAP1B light chain 3 B MAP1LC3B Microtubule-associated protein 1 light chain 3 beta
Type:
Protein
Mol. Mass.:
14691.38
Organism:
Human
Description:
Q9GZQ8
Residue:
125
  
Inhibitor
Name:
BDBM500132
Synonyms:
US11021457, Compound 144
Type:
Small organic molecule
Emp. Form.:
C27H21ClF3N3O5
Mol. Mass.:
559.921
SMILES:
FC(F)(F)c1ccc(Cl)c(c1)C1CC(=O)C(=CNc2cccc3C(=O)N(Cc23)C2CCC(=O)NC2=O)C(=O)C1
: