Target
Microtubule-associated proteins 1A/1B light chain 3B
Ligand
BDBM500146
Substrate
Meas. Tech.
Assay Targeting LC3B
IC50
<3±n/a nM
Citation
 Yao, ZLuo, CXie, YYue, LWan, WZhang, YJiang, HChen, K Class of isoindolone-imide ring-1,3-dione-2-ene compounds, composition and use thereof US Patent  US11021457 Publication Date 6/1/2021 
Target
Name:
Microtubule-associated proteins 1A/1B light chain 3B
Synonyms:
Autophagy-related protein LC3 B MAP1 light chain 3-like protein 2 MAP1A/MAP1B light chain 3 B MAP1LC3B Microtubule-associated protein 1 light chain 3 beta
Type:
Protein
Mol. Mass.:
14691.38
Organism:
Human
Description:
Q9GZQ8
Residue:
125
  
Inhibitor
Name:
BDBM500146
Synonyms:
US11021457, Compound 158
Type:
Small organic molecule
Emp. Form.:
C35H33Cl2F3N6O7
Mol. Mass.:
777.574
SMILES:
FC(F)(F)c1ccc(Cl)c(C2CC(=O)C(=CNCCN3CCN(CC(=O)Nc4cccc5C(=O)N(C6CCC(=O)NC6=O)C(=O)c45)CC3)C(=O)C2)c1Cl
: