Target
Plasma kallikrein
Ligand
BDBM283424
Substrate
Meas. Tech.
In Vitro Enzyme Inhibition
IC50
<100±n/a nM
Citation
 McDonald, AQian, S Therapeutic inhibitory compounds US Patent  US11021463 Publication Date 6/1/2021 
Target
Name:
Plasma kallikrein
Synonyms:
Fletcher factor KLKB1 Kallikrein Plasma kallikrein heavy chain Plasma prekallikrein
Type:
Protein
Mol. Mass.:
71391.16
Organism:
Homo sapiens (Human)
Description:
P03952
Residue:
638
  
Inhibitor
Name:
BDBM283424
Synonyms:
2-((8-cyano-3-methylquinolin-6-yl)methyl)-N- ((6-fluoro-1H-indol-5-yl)methyl)isonicotinamide US10266515, Example 76 US11021463, Example 76 | US9611252, Example 76
Type:
Small organic molecule
Emp. Form.:
C27H20FN5O
Mol. Mass.:
449.479
SMILES:
Cc1cnc2c(cc(Cc3cc(ccn3)C(=O)NCc3cc4cc[nH]c4cc3F)cc2c1)C#N
: