Target
Phosphatidylinositol 4,5-bisphosphate 3-kinase catalytic subunit delta isoform
Ligand
BDBM500196
Substrate
Meas. Tech.
a time-resolved fluorescence resonance energy transfer (TR-FRET) assay
IC50
2.00±n/a nM
Citation
 Cai, SDu, ZKim, MLoyer-Drew, JANaduthambi, DPatel, LPhillips, BWPhillips, GStevens, KLTreiberg, JAVan Veldhuizen, JWatkins, WJYeung, SC Phosphatidylinositol 3-kinase inhibitors US Patent  US11021467 Publication Date 6/1/2021 
Target
Name:
Phosphatidylinositol 4,5-bisphosphate 3-kinase catalytic subunit delta isoform
Synonyms:
PI3-kinase p110 subunit delta PI3-kinase subunit p110-delta PIK3CD Phosphatidylinositol 4,5-biphosphate 3-kinase catalytic subunit delta (PIK3CD) Phosphatidylinositol 4,5-bisphosphate 3-kinase 110 kDa catalytic subunit delta (PI3K delta) Phosphatidylinositol 4,5-bisphosphate 3-kinase catalytic subunit delta (PI3Kdelta) Phosphatidylinositol 4,5-bisphosphate 3-kinase catalytic subunit delta isoform (PI3K delta) Phosphatidylinositol 4,5-bisphosphate 3-kinase catalytic subunit delta isoform (PI3K-delta) Phosphatidylinositol 4,5-bisphosphate 3-kinase catalytic subunit delta isoform (PI3Kdelta)
Type:
Enzyme Subunit
Mol. Mass.:
119489.41
Organism:
Homo sapiens (Human)
Description:
O00329
Residue:
1044
  
Inhibitor
Name:
BDBM500196
Synonyms:
US11021467, Compound 53
Type:
Small organic molecule
Emp. Form.:
C22H24ClN9O2
Mol. Mass.:
481.938
SMILES:
CC(=O)NCCCn1c(nc2cccc(Cl)c2c1=O)[C@@H](Nc1nc(N)nc(N)c1C#N)C1CC1
: