Target
Glutaminyl-peptide cyclotransferase
Ligand
BDBM7922
Substrate
BDBM7883
Meas. Tech.
QC Inhibition Testing
Ki
760±n/a nM
Citation
 Buchholz, MHeiser, USchilling, SNiestroj, AJZunkel, KDemuth, HU The first potent inhibitors for human glutaminyl cyclase: synthesis and structure-activity relationship. J Med Chem 49:664-77 (2006)  
Target
Name:
Glutaminyl-peptide cyclotransferase
Synonyms:
Glutaminyl Cyclase Glutaminyl-peptide cyclotransferase Glutaminyl-tRNA cyclotransferase QPCT | QPCT_HUMAN
Type:
Enzyme
Mol. Mass.:
40877.05
Organism:
Homo sapiens (Human)
Description:
Q16769
Residue:
361
  
Inhibitor
Name:
BDBM7922
Synonyms:
1-((S)-3-(1H-Imidazol-1-yl)-2-methylpropyl)-3-(3,4-dimethoxyphenyl)thiourea 1-alkylimidazole thiourea deriv. 57
Type:
Small organic molecule
Emp. Form.:
C16H22N4O2S
Mol. Mass.:
334.436
SMILES:
COc1ccc(NC(=S)NC[C@H](C)Cn2ccnc2)cc1OC
:
Substrate
Name:
BDBM7883
Synonyms:
(2S)-2-amino-N-(4-methyl-2-oxo-2H-chromen-7-yl)pentanediamide L-glutaminyl-4-methylcoumarinylamide
Type:
Small organic molecule
Emp. Form.:
C15H17N3O4
Mol. Mass.:
303.3132
SMILES:
Cc1cc(=O)oc2cc(NC(=O)[C@@H](N)CCC(N)=O)ccc12
: