Target
Egl nine homolog 1
Ligand
BDBM500326
Substrate
Meas. Tech.
Effect of Compounds on Activities of HIF Prolyl Hydroxylase-2
IC50
1500±n/a nM
Citation
 Liu, DChen, DDeng, BTu, XFang, ZWu, HGu, D Indolizine derivatives and their application in medicine US Patent  US11021478 Publication Date 6/1/2021 
Target
Name:
Egl nine homolog 1
Synonyms:
C1orf12 EGLN1_HUMAN Hypoxia-inducible factor prolyl hydroxylase 2 (HIF-PH2) Prolyl hydroxylase domain-containing protein 2 (PHD2)
Type:
Protein
Mol. Mass.:
46035.59
Organism:
Homo sapiens (Human)
Description:
Q9GZT9
Residue:
426
  
Inhibitor
Name:
BDBM500326
Synonyms:
US11021478, Example 7 | US11655249, Example 7
Type:
Small organic molecule
Emp. Form.:
C15H16N2O5
Mol. Mass.:
304.2979
SMILES:
C[C@H](NC(=O)C1=C(O)C2(CCC2)n2cccc2C1=O)C(O)=O
: