Target
Egl nine homolog 1
Ligand
BDBM500333
Substrate
Meas. Tech.
Effect of Compounds on Activities of HIF Prolyl Hydroxylase-2
IC50
>10000±n/a nM
Citation
 Liu, DChen, DDeng, BTu, XFang, ZWu, HGu, D Indolizine derivatives and their application in medicine US Patent  US11021478 Publication Date 6/1/2021 
Target
Name:
Egl nine homolog 1
Synonyms:
C1orf12 EGLN1_HUMAN Hypoxia-inducible factor prolyl hydroxylase 2 (HIF-PH2) Prolyl hydroxylase domain-containing protein 2 (PHD2)
Type:
Protein
Mol. Mass.:
46035.59
Organism:
Homo sapiens (Human)
Description:
Q9GZT9
Residue:
426
  
Inhibitor
Name:
BDBM500333
Synonyms:
US11021478, Example 21 | US11655249, Example 21
Type:
Small organic molecule
Emp. Form.:
C18H22N2O5
Mol. Mass.:
346.3777
SMILES:
CCOC(=O)[C@H](C)NC(=O)C1=C(O)C2(CCCC2)n2cccc2C1=O
: