Target
Egl nine homolog 1
Ligand
BDBM500334
Substrate
Meas. Tech.
Effect of Compounds on Activities of HIF Prolyl Hydroxylase-2
IC50
>10000±n/a nM
Citation
 Liu, DChen, DDeng, BTu, XFang, ZWu, HGu, D Indolizine derivatives and their application in medicine US Patent  US11021478 Publication Date 6/1/2021 
Target
Name:
Egl nine homolog 1
Synonyms:
C1orf12 EGLN1_HUMAN Hypoxia-inducible factor prolyl hydroxylase 2 (HIF-PH2) Prolyl hydroxylase domain-containing protein 2 (PHD2)
Type:
Protein
Mol. Mass.:
46035.59
Organism:
Homo sapiens (Human)
Description:
Q9GZT9
Residue:
426
  
Inhibitor
Name:
BDBM500334
Synonyms:
US11021478, Example 22 | US11655249, Example 22
Type:
Small organic molecule
Emp. Form.:
C22H28N2O7
Mol. Mass.:
432.4669
SMILES:
CC(C)(C)C(=O)OCOC(=O)CNC(=O)C1=C(O)C2(CCCCC2)n2cccc2C1=O
: