Target
Egl nine homolog 1
Ligand
BDBM500335
Substrate
Meas. Tech.
Effect of Compounds on Activities of HIF Prolyl Hydroxylase-2
IC50
800±n/a nM
Citation
 Liu, DChen, DDeng, BTu, XFang, ZWu, HGu, D Indolizine derivatives and their application in medicine US Patent  US11021478 Publication Date 6/1/2021 
Target
Name:
Egl nine homolog 1
Synonyms:
C1orf12 EGLN1_HUMAN Hypoxia-inducible factor prolyl hydroxylase 2 (HIF-PH2) Prolyl hydroxylase domain-containing protein 2 (PHD2)
Type:
Protein
Mol. Mass.:
46035.59
Organism:
Homo sapiens (Human)
Description:
Q9GZT9
Residue:
426
  
Inhibitor
Name:
BDBM500335
Synonyms:
US11021478, Example 30 | US11655249, Example 30
Type:
Small organic molecule
Emp. Form.:
C19H22N2O5
Mol. Mass.:
358.3884
SMILES:
OC(=O)CNC(=O)C1=C(O)C2(CCCCC2)n2c(ccc2C1=O)C1CC1
: