Target
Mitogen-activated protein kinase kinase kinase kinase 1
Ligand
BDBM500588
Substrate
Meas. Tech.
Biochemical Enzyme Assay
IC50
<100±n/a nM
Citation
 Kaila, NLinney, IWard, SWishart, GWhittaker, BCote, AGreenwood, JRLeffler, AAlbanese, SKSeverance, DL Substituted isoindolin-1-ones and 2,3-dihydro-1h-pyrrolo[3,4-c]pyridin-1-ones as HPK1 antagonists US Patent  US11021481 Publication Date 6/1/2021 
Target
Name:
Mitogen-activated protein kinase kinase kinase kinase 1
Synonyms:
HPK1 MAP4K1
Type:
PROTEIN
Mol. Mass.:
91316.07
Organism:
Homo sapiens (Human)
Description:
ChEMBL_586597
Residue:
833
  
Inhibitor
Name:
BDBM500588
Synonyms:
7-[[6-(4- methylpiperazin- 1-yl)-2- pyridyl]amino]- 4-(1-methylpyrrolo [2,3-b]pyridin- 4-yl)isoindolin- 1-one US11078201, Compound I-247 | US11548890, Compound I-247
Type:
Small organic molecule
Emp. Form.:
C26H27N7O
Mol. Mass.:
453.5389
SMILES:
CN1CCN(CC1)c1cccc(Nc2ccc(c3CNC(=O)c23)-c2ccnc3n(C)ccc23)n1
: