Target
Mitogen-activated protein kinase kinase kinase kinase 1
Ligand
BDBM500596
Substrate
Meas. Tech.
Biochemical Enzyme Assay
IC50
<100±n/a nM
Citation
 Kaila, NLinney, IWard, SWishart, GWhittaker, BCote, AGreenwood, JRLeffler, AAlbanese, SKSeverance, DL Substituted isoindolin-1-ones and 2,3-dihydro-1h-pyrrolo[3,4-c]pyridin-1-ones as HPK1 antagonists US Patent  US11021481 Publication Date 6/1/2021 
Target
Name:
Mitogen-activated protein kinase kinase kinase kinase 1
Synonyms:
HPK1 MAP4K1
Type:
PROTEIN
Mol. Mass.:
91316.07
Organism:
Homo sapiens (Human)
Description:
ChEMBL_586597
Residue:
833
  
Inhibitor
Name:
BDBM500596
Synonyms:
7-((5-(4- methylpiperazin- 1-yl)pyridin- 2-yl)amino)-4- (4,5,6,7- tetrahydropyra- zolo[1,5- a]pyridin-3- yl)-2,3- dihydro-1H- pyrrolo[3,4- c]pyridin-1-one US11078201, Compound I-255 | US11548890, Compound I-255
Type:
Small organic molecule
Emp. Form.:
C24H28N8O
Mol. Mass.:
444.5321
SMILES:
CN1CCN(CC1)c1ccc(Nc2cnc(c3CNC(=O)c23)-c2cnn3CCCCc23)nc1
: