Target
Mitogen-activated protein kinase kinase kinase kinase 1
Ligand
BDBM501097
Substrate
Meas. Tech.
Biochemical Enzyme Assay
IC50
<100±n/a nM
Citation
 Kaila, NLinney, IWard, SWishart, GWhittaker, BCote, AGreenwood, JRLeffler, AAlbanese, SKSeverance, DL Substituted isoindolin-1-ones and 2,3-dihydro-1h-pyrrolo[3,4-c]pyridin-1-ones as HPK1 antagonists US Patent  US11021481 Publication Date 6/1/2021 
Target
Name:
Mitogen-activated protein kinase kinase kinase kinase 1
Synonyms:
HPK1 MAP4K1
Type:
PROTEIN
Mol. Mass.:
91316.07
Organism:
Homo sapiens (Human)
Description:
ChEMBL_586597
Residue:
833
  
Inhibitor
Name:
BDBM501097
Synonyms:
(R)-7-((6- ((dimethylamino)- methyl)-5-(2-(2- hydroxypropan- 2-yl)morpholino) pyridin-2- yl)amino)-4- (1-methyl-1H- pyrrolo[2,3- b]pyridin-4-yl)-2,3- dihydro-1H- pyrrolo[3,4- c]pyridin-1- one US11078201, Compound I-769 | US11548890, Compound I-769
Type:
Small organic molecule
Emp. Form.:
C30H36N8O3
Mol. Mass.:
556.6586
SMILES:
CN(C)Cc1nc(Nc2cnc(c3CNC(=O)c23)-c2ccnc3n(C)ccc23)ccc1N1CCO[C@@H](C1)C(C)(C)O
: