Target
Mitogen-activated protein kinase kinase kinase kinase 1
Ligand
BDBM501145
Substrate
Meas. Tech.
Biochemical Enzyme Assay
IC50
<100±n/a nM
Citation
 Kaila, NLinney, IWard, SWishart, GWhittaker, BCote, AGreenwood, JRLeffler, AAlbanese, SKSeverance, DL Substituted isoindolin-1-ones and 2,3-dihydro-1h-pyrrolo[3,4-c]pyridin-1-ones as HPK1 antagonists US Patent  US11021481 Publication Date 6/1/2021 
Target
Name:
Mitogen-activated protein kinase kinase kinase kinase 1
Synonyms:
HPK1 MAP4K1
Type:
PROTEIN
Mol. Mass.:
91316.07
Organism:
Homo sapiens (Human)
Description:
ChEMBL_586597
Residue:
833
  
Inhibitor
Name:
BDBM501145
Synonyms:
7-((6-((R)-1- (dimethylami- no)ethyl)-5- ((R)-THF-3- yl)pyridin-2- yl)amino)-4- (7-fluoroimidazo [1,2-a]pyridin- 3-yl)isoindolin- 1-one US11021481, Compound I-821 US11548890, Compound I-821
Type:
Small organic molecule
Emp. Form.:
C28H29FN6O2
Mol. Mass.:
500.5673
SMILES:
C[C@@H](N(C)C)c1nc(Nc2ccc(c3CNC(=O)c23)-c2cnc3cc(F)ccn23)ccc1[C@H]1CCOC1
: