Target
Beta-secretase 1
Ligand
BDBM50510783
Substrate
Meas. Tech.
In Vitro Enzymatic BACE1 and BACE2 FRET (Fluorescence Resonance Energy Transfer) Assays
IC50
1.000±n/a nM
Citation
 Allen, JRBourbeau, MPBrown, JAChen, NFrohn, MJFu, ZLiu, LLiu, QPettus, LHQian, WReeves, CSiegmund, AC 1,4-thiazine dioxide and 1,2,4-thiadiazine dioxide derivatives as beta-secretase inhibitors and methods of use US Patent  US11021493 Publication Date 6/1/2021 
Target
Name:
Beta-secretase 1
Synonyms:
ASP2 Aspartyl protease 2 BACE1 Beta-secretase (BACE) Beta-secretase 1 (BACE 1) Beta-secretase 1 (BACE1) Beta-site amyloid precursor protein cleaving enzyme 1 Memapsin-2 beta-Secretase (BACE-1) | beta-Secretase (BACE1)
Type:
Protein
Mol. Mass.:
55755.10
Organism:
Homo sapiens (Human)
Description:
P56817
Residue:
501
  
Inhibitor
Name:
BDBM50510783
Synonyms:
CHEMBL4470897 | US11021493, Example 123
Type:
Small organic molecule
Emp. Form.:
C22H22F2N4O3S
Mol. Mass.:
460.497
SMILES:
CC1(C)C(N)=N[C@@](C)(CS1(=O)=O)c1cc(\C=C(/F)c2cnc(OCC#C)cn2)ccc1F
: