Target
Isocitrate dehydrogenase [NADP] cytoplasmic [R132C]
Ligand
BDBM363538
Substrate
IC50
<100±n/a nM
Citation
 Lemieux, RMPopovici-Muller, JTravins, JCai, ZCui, DZhou, D Therapeutically active compounds and their methods of use US Patent  US11021515 Publication Date 6/1/2021 
Target
Name:
Isocitrate dehydrogenase [NADP] cytoplasmic [R132C]
Synonyms:
IDH1 IDH1(R132C) Isocitrate dehydrogenase (IDH1)(R132C) Isocitrate dehydrogenase [NADP] cytoplasmic (IDH1) (R132C) | PICD
Type:
Enzyme Catalytic Domain
Mol. Mass.:
46607.23
Organism:
Homo sapiens (Human)
Description:
O75874[R132C]
Residue:
414
  
Inhibitor
Name:
BDBM363538
Synonyms:
US10640534, Compound 30 US10717764, Compound 30 US11667673, Compound 30 | US9850277, Compound 30
Type:
Small organic molecule
Emp. Form.:
C27H23ClF3N5O4
Mol. Mass.:
573.951
SMILES:
Fc1cccc(c1)N(C(C(=O)NC1CC(F)(F)C1)c1ccccc1Cl)C(=O)[C@@H]1COCC(=O)N1c1ncccn1
: