Target
Isocitrate dehydrogenase [NADP] cytoplasmic [R132H]
Ligand
BDBM363606
Substrate
Meas. Tech.
In Vitro Assays for IDH1m (R132H or R132C) Inhibitors
IC50
<100±n/a nM
Citation
 Lemieux, RMPopovici-Muller, JTravins, JCai, ZCui, DZhou, D Therapeutically active compounds and their methods of use US Patent  US11021515 Publication Date 6/1/2021 
Target
Name:
Isocitrate dehydrogenase [NADP] cytoplasmic [R132H]
Synonyms:
Cytosolic NADP-isocitrate dehydrogenase (IDH1)(R132H) IDH1 R132H IDHC_HUMAN Isocitrate dehydrogenase 1 mutant (R132H) Isocitrate dehydrogenase [NADP] cytoplasmic (IDH1)(R132H) PICD
Type:
Protein
Mol. Mass.:
46641.74
Organism:
Homo sapiens (Human)
Description:
Human IDH1 R132H (SEQ ID No. 2 in patent). First three are removed. Google patent parsed wrong.
Residue:
414
  
Inhibitor
Name:
BDBM363606
Synonyms:
US10640534, Compound 95 US10717764, Compound 95 US11667673, Compound 95 | US9850277, Compound 95
Type:
Small organic molecule
Emp. Form.:
C32H30ClF2N5O5S
Mol. Mass.:
670.126
SMILES:
CS(=O)(=O)c1cccc(c1)N(C(C(=O)NC1CCC(F)(F)CC1)c1ccccc1Cl)C(=O)[C@@H]1CCC(=O)N1c1cc(ccn1)C#N
: