Target
Dual specificity calcium/calmodulin-dependent 3',5'-cyclic nucleotide phosphodiesterase 1B
Ligand
BDBM279054
Substrate
Meas. Tech.
Inhibition Assay
IC50
0.220±n/a nM
Citation
 Kehler, JJuhl, KMarigo, MVital, PJJessing, MLanggård, MRasmussen, LKClementson, CM 1H-pyrazolo[4,3-b]pyridines as PDE1 inhibitors US Patent  US11026923 Publication Date 6/8/2021 
Target
Name:
Dual specificity calcium/calmodulin-dependent 3',5'-cyclic nucleotide phosphodiesterase 1B
Synonyms:
63 kDa Cam-PDE Calcium/calmodulin-dependent 3',5'-cyclic nucleotide phosphodiesterase 1B PDE1B PDE1B_HUMAN Phosphodiesterase 1B Phosphodiesterase Type 1 (PDE1B) | Phosphodiesterase, PDE1/PDE5
Type:
Enzyme
Mol. Mass.:
61366.51
Organism:
Homo sapiens (Human)
Description:
Residue:
536
  
Inhibitor
Name:
BDBM279054
Synonyms:
5-(2-ethoxy-3-pyridyl)-N-[(2-fluoro-3-pyridyl)methyl]-1-isopropyl-3-methyl-pyrazolo[4,3-b]pyridin-7-amine US10512632, Example 85 US10806718, Example 85 US11491140, Example 85 | US11634416, Example 85
Type:
Small organic molecule
Emp. Form.:
C23H25FN6O
Mol. Mass.:
420.4826
SMILES:
CCOc1ncccc1-c1cc(NCc2cccnc2F)c2n(nc(C)c2n1)C(C)C
: