Target
Dual specificity calcium/calmodulin-dependent 3',5'-cyclic nucleotide phosphodiesterase 1B
Ligand
BDBM501497
Substrate
Meas. Tech.
Inhibition Assay
IC50
0.310±n/a nM
Citation
 Kehler, JJuhl, KMarigo, MVital, PJJessing, MLanggård, MRasmussen, LKClementson, CM 1H-pyrazolo[4,3-b]pyridines as PDE1 inhibitors US Patent  US11026923 Publication Date 6/8/2021 
Target
Name:
Dual specificity calcium/calmodulin-dependent 3',5'-cyclic nucleotide phosphodiesterase 1B
Synonyms:
63 kDa Cam-PDE Calcium/calmodulin-dependent 3',5'-cyclic nucleotide phosphodiesterase 1B PDE1B PDE1B_HUMAN Phosphodiesterase 1B Phosphodiesterase Type 1 (PDE1B) | Phosphodiesterase, PDE1/PDE5
Type:
Enzyme
Mol. Mass.:
61366.51
Organism:
Homo sapiens (Human)
Description:
Residue:
536
  
Inhibitor
Name:
BDBM501497
Synonyms:
5-(2-ethoxy-3-pyridyl)-3-methyl-1-[1- methylpropyl]-N-[(2-methyltetrazol-5- yl)methyl]pyrazolo[4,3-b]pyridin-7-amine, enantiomer 2 | US11026923, Example 127
Type:
Small organic molecule
Emp. Form.:
C21H29N9O
Mol. Mass.:
423.5147
SMILES:
CCOc1ncccc1-c1cc(NCc2nnn(C)n2)c(NC(C)CC)c(n1)C(C)=N
: