Target
Protein-arginine deiminase type-4
Ligand
BDBM501407
Substrate
Meas. Tech.
Inhibition Assay
IC50
11500±n/a nM
Citation
 Devraj, RKumaravel, GLecci, CLoke, PLMeniconi, MMonck, NJNorth, CLRidgill, MPTye, H Heteroaryl inhibitors of PAD4 US Patent  US11026937 Publication Date 6/8/2021 
Target
Name:
Protein-arginine deiminase type-4
Synonyms:
PAD4 PADI4_HUMAN PDI5
Type:
Enzyme Catalytic Domain
Mol. Mass.:
74078.90
Organism:
Homo sapiens (Human)
Description:
gi_216548487
Residue:
663
  
Inhibitor
Name:
BDBM501407
Synonyms:
US11026937, Compound I-2
Type:
Small organic molecule
Emp. Form.:
C26H23FN4O2
Mol. Mass.:
442.4848
SMILES:
CN(C)CCn1c2ccc(F)cc2c(-c2ccccc2)c(C(=O)\C=C\c2cncnc2)c1=O
: