Target
Protein-arginine deiminase type-4
Ligand
BDBM501446
Substrate
Meas. Tech.
Inhibition Assay
IC50
11500±n/a nM
Citation
 Devraj, RKumaravel, GLecci, CLoke, PLMeniconi, MMonck, NJNorth, CLRidgill, MPTye, H Heteroaryl inhibitors of PAD4 US Patent  US11026937 Publication Date 6/8/2021 
Target
Name:
Protein-arginine deiminase type-4
Synonyms:
PAD4 PADI4_HUMAN PDI5
Type:
Enzyme Catalytic Domain
Mol. Mass.:
74078.90
Organism:
Homo sapiens (Human)
Description:
gi_216548487
Residue:
663
  
Inhibitor
Name:
BDBM501446
Synonyms:
US11026937, Compound I-41
Type:
Small organic molecule
Emp. Form.:
C29H26FN3O4
Mol. Mass.:
499.5328
SMILES:
Fc1ccc2[nH]c(=O)c(C(=O)\C=C\c3ccc(=O)n(CCN4CCOCC4)c3)c(-c3ccccc3)c2c1
: