Target
Protein-arginine deiminase type-4
Ligand
BDBM501447
Substrate
Meas. Tech.
Inhibition Assay
IC50
70000±n/a nM
Citation
 Devraj, RKumaravel, GLecci, CLoke, PLMeniconi, MMonck, NJNorth, CLRidgill, MPTye, H Heteroaryl inhibitors of PAD4 US Patent  US11026937 Publication Date 6/8/2021 
Target
Name:
Protein-arginine deiminase type-4
Synonyms:
PAD4 PADI4_HUMAN PDI5
Type:
Enzyme Catalytic Domain
Mol. Mass.:
74078.90
Organism:
Homo sapiens (Human)
Description:
gi_216548487
Residue:
663
  
Inhibitor
Name:
BDBM501447
Synonyms:
US11026937, Compound I-42
Type:
Small organic molecule
Emp. Form.:
C23H16FN3O2
Mol. Mass.:
385.3904
SMILES:
Fc1ccc2[nH]c(=O)c(NC(=O)\C=C\c3cccnc3)c(-c3ccccc3)c2c1
: