Target
Protein-arginine deiminase type-4
Ligand
BDBM501451
Substrate
Meas. Tech.
Inhibition Assay
IC50
11500±n/a nM
Citation
 Devraj, RKumaravel, GLecci, CLoke, PLMeniconi, MMonck, NJNorth, CLRidgill, MPTye, H Heteroaryl inhibitors of PAD4 US Patent  US11026937 Publication Date 6/8/2021 
Target
Name:
Protein-arginine deiminase type-4
Synonyms:
PAD4 PADI4_HUMAN PDI5
Type:
Enzyme Catalytic Domain
Mol. Mass.:
74078.90
Organism:
Homo sapiens (Human)
Description:
gi_216548487
Residue:
663
  
Inhibitor
Name:
BDBM501451
Synonyms:
US11026937, Compound I-46
Type:
Small organic molecule
Emp. Form.:
C22H13F2N3O2
Mol. Mass.:
389.3543
SMILES:
Fc1cncc(\C=C\C(=O)c2c(-c3ccccc3)c3cc(F)cnc3[nH]c2=O)c1
: