Target
Protein-arginine deiminase type-4
Ligand
BDBM501468
Substrate
Meas. Tech.
Inhibition Assay
IC50
1500±n/a nM
Citation
 Devraj, RKumaravel, GLecci, CLoke, PLMeniconi, MMonck, NJNorth, CLRidgill, MPTye, H Heteroaryl inhibitors of PAD4 US Patent  US11026937 Publication Date 6/8/2021 
Target
Name:
Protein-arginine deiminase type-4
Synonyms:
PAD4 PADI4_HUMAN PDI5
Type:
Enzyme Catalytic Domain
Mol. Mass.:
74078.90
Organism:
Homo sapiens (Human)
Description:
gi_216548487
Residue:
663
  
Inhibitor
Name:
BDBM501468
Synonyms:
US11026937, Compound I-61
Type:
Small organic molecule
Emp. Form.:
C24H17FN2O2
Mol. Mass.:
384.4024
SMILES:
Cc1ccncc1\C=C\C(=O)c1c(-c2ccccc2)c2cc(F)ccc2[nH]c1=O
: