Target
Protein-arginine deiminase type-4
Ligand
BDBM501516
Substrate
Meas. Tech.
Inhibition Assay
IC50
70000±n/a nM
Citation
 Devraj, RKumaravel, GLecci, CLoke, PLMeniconi, MMonck, NJNorth, CLRidgill, MPTye, H Heteroaryl inhibitors of PAD4 US Patent  US11026937 Publication Date 6/8/2021 
Target
Name:
Protein-arginine deiminase type-4
Synonyms:
PAD4 PADI4_HUMAN PDI5
Type:
Enzyme Catalytic Domain
Mol. Mass.:
74078.90
Organism:
Homo sapiens (Human)
Description:
gi_216548487
Residue:
663
  
Inhibitor
Name:
BDBM501516
Synonyms:
US11026937, Compound I-92
Type:
Small organic molecule
Emp. Form.:
C23H17N3O2
Mol. Mass.:
367.4
SMILES:
Cc1cccc(c1)-c1c(C(=O)\C=C\c2cncnc2)c(=O)[nH]c2ccccc12
: