Target
Protein-arginine deiminase type-4
Ligand
BDBM501550
Substrate
Meas. Tech.
Inhibition Assay
IC50
70000±n/a nM
Citation
 Devraj, RKumaravel, GLecci, CLoke, PLMeniconi, MMonck, NJNorth, CLRidgill, MPTye, H Heteroaryl inhibitors of PAD4 US Patent  US11026937 Publication Date 6/8/2021 
Target
Name:
Protein-arginine deiminase type-4
Synonyms:
PAD4 PADI4_HUMAN PDI5
Type:
Enzyme Catalytic Domain
Mol. Mass.:
74078.90
Organism:
Homo sapiens (Human)
Description:
gi_216548487
Residue:
663
  
Inhibitor
Name:
BDBM501550
Synonyms:
US11026937, Compound I-126
Type:
Small organic molecule
Emp. Form.:
C23H21NO2
Mol. Mass.:
343.4183
SMILES:
O=C(\C=C\C1CCCC1)c1c(-c2ccccc2)c2ccccc2[nH]c1=O
: