Target
Protein-arginine deiminase type-4
Ligand
BDBM501556
Substrate
Meas. Tech.
Inhibition Assay
IC50
11500±n/a nM
Citation
 Devraj, RKumaravel, GLecci, CLoke, PLMeniconi, MMonck, NJNorth, CLRidgill, MPTye, H Heteroaryl inhibitors of PAD4 US Patent  US11026937 Publication Date 6/8/2021 
Target
Name:
Protein-arginine deiminase type-4
Synonyms:
PAD4 PADI4_HUMAN PDI5
Type:
Enzyme Catalytic Domain
Mol. Mass.:
74078.90
Organism:
Homo sapiens (Human)
Description:
gi_216548487
Residue:
663
  
Inhibitor
Name:
BDBM501556
Synonyms:
US11026937, Compound I-129
Type:
Small organic molecule
Emp. Form.:
C23H16N2O2
Mol. Mass.:
352.3853
SMILES:
O=C(\C=C\c1ccccn1)c1c(-c2ccccc2)c2ccccc2[nH]c1=O
: