Target
Protein-arginine deiminase type-4
Ligand
BDBM501563
Substrate
Meas. Tech.
Inhibition Assay
IC50
70000±n/a nM
Citation
 Devraj, RKumaravel, GLecci, CLoke, PLMeniconi, MMonck, NJNorth, CLRidgill, MPTye, H Heteroaryl inhibitors of PAD4 US Patent  US11026937 Publication Date 6/8/2021 
Target
Name:
Protein-arginine deiminase type-4
Synonyms:
PAD4 PADI4_HUMAN PDI5
Type:
Enzyme Catalytic Domain
Mol. Mass.:
74078.90
Organism:
Homo sapiens (Human)
Description:
gi_216548487
Residue:
663
  
Inhibitor
Name:
BDBM501563
Synonyms:
US11026937, Compound I-136
Type:
Small organic molecule
Emp. Form.:
C19H15NO3
Mol. Mass.:
305.3273
SMILES:
COc1ccc(\C=C\C(=O)c2cc3ccccc3[nH]c2=O)cc1
: