Target
Protein-arginine deiminase type-4
Ligand
BDBM501566
Substrate
Meas. Tech.
Inhibition Assay
IC50
11500±n/a nM
Citation
 Devraj, RKumaravel, GLecci, CLoke, PLMeniconi, MMonck, NJNorth, CLRidgill, MPTye, H Heteroaryl inhibitors of PAD4 US Patent  US11026937 Publication Date 6/8/2021 
Target
Name:
Protein-arginine deiminase type-4
Synonyms:
PAD4 PADI4_HUMAN PDI5
Type:
Enzyme Catalytic Domain
Mol. Mass.:
74078.90
Organism:
Homo sapiens (Human)
Description:
gi_216548487
Residue:
663
  
Inhibitor
Name:
BDBM501566
Synonyms:
US11026937, Compound I-137
Type:
Small organic molecule
Emp. Form.:
C27H23NO3
Mol. Mass.:
409.4764
SMILES:
COc1ccc(\C=C\C(=O)c2c(-c3ccccc3)c3cc(C)ccc3n(C)c2=O)cc1
: