Target
Endoplasmin
Ligand
BDBM501634
Substrate
Meas. Tech.
Fluorescence Polarization Assay
Kd
6100±300 nM
Citation
 Blagg, BSCrowley, VM Second generation GRP94-selective inhibitors US Patent  US11028041 Publication Date 6/8/2021 
Target
Name:
Endoplasmin
Synonyms:
ENPL_CANLF HSP90B1 TRA1
Type:
PROTEIN
Mol. Mass.:
92464.42
Organism:
Canis familiaris
Description:
ChEMBL_1478277
Residue:
804
  
Inhibitor
Name:
BDBM501634
Synonyms:
US11028041, Compound 25
Type:
Small organic molecule
Emp. Form.:
C25H25ClO5
Mol. Mass.:
440.916
SMILES:
CCOc1ccccc1Cc1ccccc1CCc1c(Cl)c(O)cc(O)c1C(=O)OC
: