Target
Endoplasmin
Ligand
BDBM501636
Substrate
Meas. Tech.
Fluorescence Polarization Assay
Kd
5500±100 nM
Citation
 Blagg, BSCrowley, VM Second generation GRP94-selective inhibitors US Patent  US11028041 Publication Date 6/8/2021 
Target
Name:
Endoplasmin
Synonyms:
ENPL_CANLF HSP90B1 TRA1
Type:
PROTEIN
Mol. Mass.:
92464.42
Organism:
Canis familiaris
Description:
ChEMBL_1478277
Residue:
804
  
Inhibitor
Name:
BDBM501636
Synonyms:
US11028041, Compound 27
Type:
Small organic molecule
Emp. Form.:
C23H20Cl2O4
Mol. Mass.:
431.309
SMILES:
COC(=O)c1c(O)cc(O)c(Cl)c1CCc1ccccc1Cc1ccccc1Cl
: