Target
Dihydroorotate dehydrogenase (quinone), mitochondrial
Ligand
BDBM501668
Substrate
Meas. Tech.
Inhibitory Enzyme Activity (In Vitro Assay)
IC50
5.5±n/a nM
Citation
 Thunuguntla, SSHosahalli, SPanigrahi, SKSchwarz, MArit, M 1, 4, 6-trisubstituted-2-alkyl-1H-benzo[d]imidazole derivatives as dihydroorotate oxygenase inhibitors US Patent  US11028054 Publication Date 6/8/2021 
Target
Name:
Dihydroorotate dehydrogenase (quinone), mitochondrial
Synonyms:
DHODH Dihydroorotate dehydrogenase Dihydroorotate dehydrogenase, mitochondrial Dihydroorotate oxidase (DHODH) | PYRD_HUMAN
Type:
Enzyme
Mol. Mass.:
42881.33
Organism:
Homo sapiens (Human)
Description:
Q02127
Residue:
395
  
Inhibitor
Name:
BDBM501668
Synonyms:
US11028054, Example 69
Type:
Small organic molecule
Emp. Form.:
C22H18N2O3
Mol. Mass.:
358.3899
SMILES:
Cc1nc2c(cc(cc2[nH]1)-c1ccc(OCc2ccccc2)cc1)C(O)=O
: