Target
Vascular endothelial growth factor receptor 2
Ligand
BDBM501695
Substrate
Meas. Tech.
Biochemical Assay
IC50
>10000±n/a nM
Citation
 Gamage, SAShepherd, PRFlanagan, JURewcastle, GWMarshall, AJBuchanan, CMLu, GBonnet, MJamieson, SMDenny, WA Tricyclic heterocyclic derivatives and uses thereof US Patent  US11028064 Publication Date 6/8/2021 
Target
Name:
Vascular endothelial growth factor receptor 2
Synonyms:
CD_antigen=CD309 Fetal liver kinase 1 (FLK-1) KDR Protein-tyrosine kinase receptor Flk-1 VEGFR-2 VEGFR2 Vascular Endothelial Growth Factor Receptor Kinase 2 Vascular endothelial growth factor receptor 2 (KDR) Vascular endothelial growth factor receptor 2 (VEGFR2) Vascular endothelial growth factor receptor-2 (VEGFR-2)
Type:
Receptor Tyrosine Kinase
Mol. Mass.:
151510.97
Organism:
Homo sapiens (Human)
Description:
P35968
Residue:
1356
  
Inhibitor
Name:
BDBM501695
Synonyms:
6-((5,6-Dimethoxypyridin-3-yl)oxy)-4-(2-(dimethylamino)ethoxy)-2-methyl-9H-xanthen-9-one | US11028064, Example 9
Type:
Small organic molecule
Emp. Form.:
C25H26N2O6
Mol. Mass.:
450.4837
SMILES:
CN(C)CCOc1cc(C)cc2c1oc1cc(Oc3cnc(CO)c(CO)c3)ccc1c2=O
: