Target
Macrophage colony-stimulating factor 1 receptor
Ligand
BDBM501711
Substrate
Meas. Tech.
Biochemical Assay
IC50
<100±n/a nM
Citation
 Gamage, SAShepherd, PRFlanagan, JURewcastle, GWMarshall, AJBuchanan, CMLu, GBonnet, MJamieson, SMDenny, WA Tricyclic heterocyclic derivatives and uses thereof US Patent  US11028064 Publication Date 6/8/2021 
Target
Name:
Macrophage colony-stimulating factor 1 receptor
Synonyms:
CSF1R FMS Macrophage colony stimulating factor receptor Macrophage colony-stimulating factor 1 receptor (c-FMS) Proto-oncogene c-Fms c-fms | cFMS
Type:
Protein
Mol. Mass.:
107979.48
Organism:
Homo sapiens (Human)
Description:
P07333
Residue:
972
  
Inhibitor
Name:
BDBM501711
Synonyms:
N-Cyclopentyl-2-((5-((5-(2-(dimethylamino)ethoxy)-7-methyl-9-oxo-9H-xanthen-3-yl)oxy)pyridin-2-yl)amino)acetamide | US11028064, Example 25
Type:
Small organic molecule
Emp. Form.:
C35H42N4O7
Mol. Mass.:
630.7306
SMILES:
CN(C)CCOc1cc(C)cc2c1oc1cc(Oc3ccc(nc3)N(CC(=O)NC3CCCC3)C(=O)OC(C)(C)C)ccc1c2=O
: