Target
Macrophage colony-stimulating factor 1 receptor
Ligand
BDBM501719
Substrate
Meas. Tech.
Biochemical Assay
IC50
550±n/a nM
Citation
 Gamage, SAShepherd, PRFlanagan, JURewcastle, GWMarshall, AJBuchanan, CMLu, GBonnet, MJamieson, SMDenny, WA Tricyclic heterocyclic derivatives and uses thereof US Patent  US11028064 Publication Date 6/8/2021 
Target
Name:
Macrophage colony-stimulating factor 1 receptor
Synonyms:
CSF1R FMS Macrophage colony stimulating factor receptor Macrophage colony-stimulating factor 1 receptor (c-FMS) Proto-oncogene c-Fms c-fms | cFMS
Type:
Protein
Mol. Mass.:
107979.48
Organism:
Homo sapiens (Human)
Description:
P07333
Residue:
972
  
Inhibitor
Name:
BDBM501719
Synonyms:
2-Methyl-4-(3-morpholinopropoxy)-6-phenoxy-9H-xanthen-9-one | US11028064, Example 33
Type:
Small organic molecule
Emp. Form.:
C27H27NO5
Mol. Mass.:
445.507
SMILES:
Cc1cc(OCCCN2CCOCC2)c2oc3cc(Oc4ccccc4)ccc3c(=O)c2c1
: