Target
Macrophage colony-stimulating factor 1 receptor
Ligand
BDBM501751
Substrate
Meas. Tech.
Biochemical Assay
IC50
<100±n/a nM
Citation
 Gamage, SAShepherd, PRFlanagan, JURewcastle, GWMarshall, AJBuchanan, CMLu, GBonnet, MJamieson, SMDenny, WA Tricyclic heterocyclic derivatives and uses thereof US Patent  US11028064 Publication Date 6/8/2021 
Target
Name:
Macrophage colony-stimulating factor 1 receptor
Synonyms:
CSF1R FMS Macrophage colony stimulating factor receptor Macrophage colony-stimulating factor 1 receptor (c-FMS) Proto-oncogene c-Fms c-fms | cFMS
Type:
Protein
Mol. Mass.:
107979.48
Organism:
Homo sapiens (Human)
Description:
P07333
Residue:
972
  
Inhibitor
Name:
BDBM501751
Synonyms:
N-Cyclopentyl-3-(5-((5-(3-(4-ethylpiperazin-1-yl)propoxy)-7-methyl-9-oxo-9H-xanthen-3-yl)oxy)pyridin-2-yl)propanamide | US11028064, Example 65
Type:
Small organic molecule
Emp. Form.:
C36H44N4O5
Mol. Mass.:
612.7584
SMILES:
CCN1CCN(CCCOc2cc(C)cc3c2oc2cc(Oc4ccc(CCC(=O)NC5CCCC5)nc4)ccc2c3=O)CC1
: