Target
Vascular endothelial growth factor receptor 2
Ligand
BDBM501753
Substrate
Meas. Tech.
Biochemical Assay
IC50
>10000±n/a nM
Citation
 Gamage, SAShepherd, PRFlanagan, JURewcastle, GWMarshall, AJBuchanan, CMLu, GBonnet, MJamieson, SMDenny, WA Tricyclic heterocyclic derivatives and uses thereof US Patent  US11028064 Publication Date 6/8/2021 
Target
Name:
Vascular endothelial growth factor receptor 2
Synonyms:
CD_antigen=CD309 Fetal liver kinase 1 (FLK-1) KDR Protein-tyrosine kinase receptor Flk-1 VEGFR-2 VEGFR2 Vascular Endothelial Growth Factor Receptor Kinase 2 Vascular endothelial growth factor receptor 2 (KDR) Vascular endothelial growth factor receptor 2 (VEGFR2) Vascular endothelial growth factor receptor-2 (VEGFR-2)
Type:
Receptor Tyrosine Kinase
Mol. Mass.:
151510.97
Organism:
Homo sapiens (Human)
Description:
P35968
Residue:
1356
  
Inhibitor
Name:
BDBM501753
Synonyms:
N-Cyclopentyl-3-(5-((5-(3-((3S,5R)-3,5-dimethylpiperazin-1-yl)propoxy)-7-methyl-9-oxo-9H-xanthen-3-yl)oxy)pyridin-2-yl)propanamide | US11028064, Example 67
Type:
Small organic molecule
Emp. Form.:
C36H44N4O5
Mol. Mass.:
612.7584
SMILES:
C[C@H]1CN(CCCOc2cc(C)cc3c2oc2cc(Oc4ccc(CCC(=O)NC5CCCC5)nc4)ccc2c3=O)C[C@@H](C)N1
: