Target
Lysine-specific histone demethylase 1A
Ligand
BDBM501764
Substrate
Meas. Tech.
In Vitro Enzyme Inhibition Assay
IC50
<100±n/a nM
Citation
 Chen, YKanouni, TStafford, JAVeal, J Inhibitors of lysine specific demethylase-1 US Patent  US11028066 Publication Date 6/8/2021 
Target
Name:
Lysine-specific histone demethylase 1A
Synonyms:
AOF2 Flavin-containing amine oxidase domain-containing protein 2 KDM1A KIAA0601 Lysine-specific demethylase 1 (LSD1) Lysine-specific histone demethylase 1 (LSD1)
Type:
Enzyme
Mol. Mass.:
92901.01
Organism:
Homo sapiens (Human)
Description:
O60341
Residue:
852
  
Inhibitor
Name:
BDBM501764
Synonyms:
4-[6-(4-aminopiperidin-1-yl)-4- [(4-methylphenyl)methyl]-5-oxo- 4,5-dihydropyrazin-2- yl]benzonitrile | US11028066, Example 2
Type:
Small organic molecule
Emp. Form.:
C24H25N5O
Mol. Mass.:
399.4882
SMILES:
Cc1ccc(Cn2cc(nc(N3CCC(N)CC3)c2=O)-c2ccc(cc2)C#N)cc1
: