Target
Lysine-specific histone demethylase 1A
Ligand
BDBM501808
Substrate
Meas. Tech.
In Vitro Enzyme Inhibition Assay
IC50
<100±n/a nM
Citation
 Chen, YKanouni, TStafford, JAVeal, J Inhibitors of lysine specific demethylase-1 US Patent  US11028066 Publication Date 6/8/2021 
Target
Name:
Lysine-specific histone demethylase 1A
Synonyms:
AOF2 Flavin-containing amine oxidase domain-containing protein 2 KDM1A KIAA0601 Lysine-specific demethylase 1 (LSD1) Lysine-specific histone demethylase 1 (LSD1)
Type:
Enzyme
Mol. Mass.:
92901.01
Organism:
Homo sapiens (Human)
Description:
O60341
Residue:
852
  
Inhibitor
Name:
BDBM501808
Synonyms:
4-[6-(4-aminopiperidyl)-4-(3- hydroxypropyl)-3-(4- methylphenyl)-5-oxo(4- hydropyrazin-2-yl)]-2- fluorobenzenecarbonitrile | US11028066, Example 46
Type:
Small organic molecule
Emp. Form.:
C26H28FN5O2
Mol. Mass.:
461.5312
SMILES:
Cc1ccc(cc1)-c1c(nc(N2CCC(N)CC2)c(=O)n1CCCO)-c1ccc(C#N)c(F)c1
: