Target
Lysine-specific histone demethylase 1A
Ligand
BDBM501815
Substrate
Meas. Tech.
In Vitro Enzyme Inhibition Assay
IC50
<100±n/a nM
Citation
 Chen, YKanouni, TStafford, JAVeal, J Inhibitors of lysine specific demethylase-1 US Patent  US11028066 Publication Date 6/8/2021 
Target
Name:
Lysine-specific histone demethylase 1A
Synonyms:
AOF2 Flavin-containing amine oxidase domain-containing protein 2 KDM1A KIAA0601 Lysine-specific demethylase 1 (LSD1) Lysine-specific histone demethylase 1 (LSD1)
Type:
Enzyme
Mol. Mass.:
92901.01
Organism:
Homo sapiens (Human)
Description:
O60341
Residue:
852
  
Inhibitor
Name:
BDBM501815
Synonyms:
5-[6-(4-amino-piperidin-1-yl)-3- (4-cyclopropyl-phenyl)-4-methyl- 5-oxo-4,5-dihydro-pyrazin-2-yl]- pyridine-2-carbonitrile | US11028066, Example 53
Type:
Small organic molecule
Emp. Form.:
C25H26N6O
Mol. Mass.:
426.5135
SMILES:
Cn1c(-c2ccc(cc2)C2CC2)c(nc(N2CCC(N)CC2)c1=O)-c1ccc(nc1)C#N
: