Target
Lysine-specific histone demethylase 1A
Ligand
BDBM501846
Substrate
Meas. Tech.
In Vitro Enzyme Inhibition Assay
IC50
<100±n/a nM
Citation
 Chen, YKanouni, TStafford, JAVeal, J Inhibitors of lysine specific demethylase-1 US Patent  US11028066 Publication Date 6/8/2021 
Target
Name:
Lysine-specific histone demethylase 1A
Synonyms:
AOF2 Flavin-containing amine oxidase domain-containing protein 2 KDM1A KIAA0601 Lysine-specific demethylase 1 (LSD1) Lysine-specific histone demethylase 1 (LSD1)
Type:
Enzyme
Mol. Mass.:
92901.01
Organism:
Homo sapiens (Human)
Description:
O60341
Residue:
852
  
Inhibitor
Name:
BDBM501846
Synonyms:
4-[5-(4-aminopiperidin-1-yl)-2-(3- fluoro-4-methoxyphenyl)-1- methyl-6-oxopyridin-3-yl]-2- fluorobenzonitrile | US11028066, Example 84
Type:
Small organic molecule
Emp. Form.:
C25H24F2N4O2
Mol. Mass.:
450.4805
SMILES:
COc1ccc(cc1F)-c1c(cc(N2CCC(N)CC2)c(=O)n1C)-c1ccc(C#N)c(F)c1
: