Target
Sodium channel protein type 9 subunit alpha
Ligand
BDBM501917
Substrate
Meas. Tech.
Electrophysiological Assay (EP) (In Vitro Assay)
IC50
1.21±n/a nM
Citation
 Sutherlin, DMcKerrall, SLai, KWLiu, ZLiu, WBeveridge, RLeclerc, JLemire, AZhao, LSturino, C Therapeutic compounds and methods of use thereof US Patent  US11028075 Publication Date 6/8/2021 
Target
Name:
Sodium channel protein type 9 subunit alpha
Synonyms:
NENA Peripheral sodium channel 1 SCN9A_HUMAN Voltage-gated sodium channel subunit Nav1.7 hNE-Na
Type:
Protein
Mol. Mass.:
226375.97
Organism:
Homo sapiens (Human)
Description:
Q15858
Residue:
1988
  
Inhibitor
Name:
BDBM501917
Synonyms:
US11028075, Example 50
Type:
Small organic molecule
Emp. Form.:
C27H27F6N5O2S
Mol. Mass.:
599.591
SMILES:
Fc1cc(c(F)cc1N[C@H]1CC[C@@H](C[C@@H]1N1CCCC1)c1cc(ccc1F)C(F)(F)F)S(=O)(=O)Nc1ccncn1
: