Target
Sodium channel protein type 9 subunit alpha
Ligand
BDBM501919
Substrate
Meas. Tech.
Radioligand Binding Assay
IC50
2000±n/a nM
Citation
 Sutherlin, DMcKerrall, SLai, KWLiu, ZLiu, WBeveridge, RLeclerc, JLemire, AZhao, LSturino, C Therapeutic compounds and methods of use thereof US Patent  US11028075 Publication Date 6/8/2021 
Target
Name:
Sodium channel protein type 9 subunit alpha
Synonyms:
NENA Peripheral sodium channel 1 SCN9A_HUMAN Voltage-gated sodium channel subunit Nav1.7 hNE-Na
Type:
Protein
Mol. Mass.:
226375.97
Organism:
Homo sapiens (Human)
Description:
Q15858
Residue:
1988
  
Inhibitor
Name:
BDBM501919
Synonyms:
US11028075, Example 52
Type:
Small organic molecule
Emp. Form.:
C27H26Cl3F4N5O2S
Mol. Mass.:
666.945
SMILES:
CN(C)[C@H]1C[C@]2([C@@H](C[C@@H]1N(C)c1cc(F)c(cc1Cl)S(=O)(=O)Nc1ccncn1)C2(Cl)Cl)c1cccc(c1)C(F)(F)F
: