Target
Sodium channel protein type 9 subunit alpha
Ligand
BDBM501922
Substrate
Meas. Tech.
Radioligand Binding Assay
IC50
6.73±n/a nM
Citation
 Sutherlin, DMcKerrall, SLai, KWLiu, ZLiu, WBeveridge, RLeclerc, JLemire, AZhao, LSturino, C Therapeutic compounds and methods of use thereof US Patent  US11028075 Publication Date 6/8/2021 
Target
Name:
Sodium channel protein type 9 subunit alpha
Synonyms:
NENA Peripheral sodium channel 1 SCN9A_HUMAN Voltage-gated sodium channel subunit Nav1.7 hNE-Na
Type:
Protein
Mol. Mass.:
226375.97
Organism:
Homo sapiens (Human)
Description:
Q15858
Residue:
1988
  
Inhibitor
Name:
BDBM501922
Synonyms:
US11028075, Example 55
Type:
Small organic molecule
Emp. Form.:
C28H29F4N5O3S
Mol. Mass.:
591.62
SMILES:
CN(C)[C@H]1C[C@H](CC[C@@H]1N1C(=O)CCc2cc(c(F)cc12)S(=O)(=O)Nc1ccncn1)c1cccc(c1)C(F)(F)F
: