Target
Sodium channel protein type 9 subunit alpha
Ligand
BDBM501927
Substrate
Meas. Tech.
Radioligand Binding Assay
IC50
1.60±n/a nM
Citation
 Sutherlin, DMcKerrall, SLai, KWLiu, ZLiu, WBeveridge, RLeclerc, JLemire, AZhao, LSturino, C Therapeutic compounds and methods of use thereof US Patent  US11028075 Publication Date 6/8/2021 
Target
Name:
Sodium channel protein type 9 subunit alpha
Synonyms:
NENA Peripheral sodium channel 1 SCN9A_HUMAN Voltage-gated sodium channel subunit Nav1.7 hNE-Na
Type:
Protein
Mol. Mass.:
226375.97
Organism:
Homo sapiens (Human)
Description:
Q15858
Residue:
1988
  
Inhibitor
Name:
BDBM501927
Synonyms:
US11028075, Example 60
Type:
Small organic molecule
Emp. Form.:
C27H27ClF4N4O3S
Mol. Mass.:
599.04
SMILES:
Fc1cc(O[C@H]2CC[C@@H](C[C@@H]2N2CCCC2)c2cccc(c2)C(F)(F)F)c(Cl)cc1S(=O)(=O)Nc1ccncn1
: